π
<-
Chat plein-écran
[^]

[Tuto] [EN/FR] Install nLoader / TI-Nspire CX

Regroupement de tous les tutoriaux Nspire.

Re: [Tuto] [EN/FR] Install nLoader / TI-Nspire CX

Message non lude parrotgeek1 » 30 Aoû 2018, 00:44

critor a écrit:I think it's been reported to work perfectly up to hardware revision AC.
Not sure about AD
(manufacturing did start around January 2018)
, and no news since then.

It works.
My Projects:
nLoaderCAS Patcher for ControlXnLaunchy CXM fork (3.9 CAS on B&W) - News Article
Prototypes:
Upgrade EVT Nspire CAS+Fix keyboard on prototype TI-Nspire CAS Touchpad
- Highlights: Nspire CX Non-CAS OS 3.3, CX OS 4.4 special reformatting installers (both found by me on TI's site)
Discoveries:
Boot1.5 vuln (used in nLoader) • Nspire dev boardsPink CX
Je peux comprendre le français mais je ne peux pas le parler bien.
Avatar de l’utilisateur
parrotgeek1Prog.
Niveau 11: LV (Légende Vivante)
Niveau 11: LV (Légende Vivante)
Prochain niv.: 4.2%
 
Messages: 689
Inscription: 29 Mar 2016, 01:22
Localisation: USA
Genre: Homme
Calculatrice(s):
Classe: university student
GitHub: parrotgeek1

Re: [Tuto] [EN/FR] Install nLoader / TI-Nspire CX

Message non lude critor » 30 Aoû 2018, 09:29

Thanks. :)
Image
Avatar de l’utilisateur
critorAdmin.
Niveau 18: DC (Deus ex Calculatorum)
Niveau 18: DC (Deus ex Calculatorum)
Prochain niv.: 77.4%
 
Messages: 30738
Images: 7284
Inscription: 25 Oct 2008, 00:00
Localisation: Montpellier
Genre: Homme
Calculatrice(s):
Classe: Lycée
YouTube: critor3000
Twitter: critor2000
Facebook: critor.ti

Re: [Tuto] [EN/FR] Install nLoader / TI-Nspire CX

Message non lude Shirotaku » 01 Sep 2018, 23:31

Hello,

I've tried to compile nLoader myself, but I'm not really into this. When I try running the make_for_nMaker.sh script (no files modified, just downloaded from github), I get the following errors:

sh .\make_for_nMaker.sh
CAS_OS
rm -f *.o *.elf
rm -f ../ndless_loader.bin
arm-none-eabi-gcc -Os -Wall -W -marm -mcpu=arm926ej-s -nostdlib -nostartfiles -s -fPIE -ffreestanding -std=c11 -o ndless_loader.o -c ndless_loader.c
ndless_loader.c: In function 'ndless_loader':
ndless_loader.c:79:14: warning: this statement may fall through [-Wimplicit-fallthrough=]
os_misc++;
~~~~~~~^~
ndless_loader.c:80:6: note: here
case CX450_1180:
^~~~
ndless_loader.c:82:14: warning: this statement may fall through [-Wimplicit-fallthrough=]
os_misc++;
~~~~~~~^~
ndless_loader.c:83:6: note: here
case CXC440_532:
^~~~
ndless_loader.c:85:14: warning: this statement may fall through [-Wimplicit-fallthrough=]
os_misc++;
~~~~~~~^~
ndless_loader.c:86:6: note: here
case CX440_532:
^~~~
ndless_loader.c:89:9: warning: this statement may fall through [-Wimplicit-fallthrough=]
if(cas == 1 && asicflags != 1) {
^
ndless_loader.c:98:6: note: here
case CXC360_546_550:
^~~~
ndless_loader.c:100:14: warning: this statement may fall through [-Wimplicit-fallthrough=]
os_misc++;
~~~~~~~^~
ndless_loader.c:101:6: note: here
case CX360_5XX:
^~~~
ndless_loader.c:149:14: warning: this statement may fall through [-Wimplicit-fallthrough=]
os_misc++;
~~~~~~~^~
ndless_loader.c:150:6: note: here
case CX450_1180:
^~~~
ndless_loader.c:151:14: warning: this statement may fall through [-Wimplicit-fallthrough=]
os_misc++;
~~~~~~~^~
ndless_loader.c:152:6: note: here
case CXC440_532:
^~~~
ndless_loader.c:153:14: warning: this statement may fall through [-Wimplicit-fallthrough=]
os_misc++;
~~~~~~~^~
ndless_loader.c:154:6: note: here
case CX440_532:
^~~~
ndless_loader.c:155:14: warning: this statement may fall through [-Wimplicit-fallthrough=]
os_misc++;
~~~~~~~^~
ndless_loader.c:156:6: note: here
case CXC360_546_550:
^~~~
ndless_loader.c:157:14: warning: this statement may fall through [-Wimplicit-fallthrough=]
os_misc++;
~~~~~~~^~
ndless_loader.c:158:6: note: here
case CX360_5XX:
^~~~
arm-none-eabi-ld -nostdlib -nostartfiles -e ndless_loader -PIE -T ldscript ndless_loader.o -o ndless_loader.elf
arm-none-eabi-objcopy -O binary ndless_loader.elf ../ndless_loader.bin
find: paths must precede expression
Usage: find [path...] [expression]
find: paths must precede expression
Usage: find [path...] [expression]
find: paths must precede expression
Usage: find [path...] [expression]
find: paths must precede expression
Usage: find [path...] [expression]
find: paths must precede expression
Usage: find [path...] [expression]
find: paths must precede expression
Usage: find [path...] [expression]
rm -f loader.bin loader.elf
find: paths must precede expression
Usage: find [path...] [expression]
find: paths must precede expression
Usage: find [path...] [expression]
find: paths must precede expression
Usage: find [path...] [expression]
arm-none-eabi-ld -nostdlib -nostartfiles -T ldscript -PIE -flto libgcc/*.o -o loader.elf
C:/SH/sh.exe: D:\Program Files (x86)\GNU Tools Arm Embedded\7 2018-q2-update\bin/arm-none-eabi-ld.exe: cannot execute binary file
C:\SH\make.exe: *** [loader.elf] Error 126
C:\SH\mv.exe: loader.bin: No such file or directory
CAS_OS_no_patches
rm -f *.o *.elf
rm -f ../ndless_loader.bin
arm-none-eabi-gcc -Os -Wall -W -marm -mcpu=arm926ej-s -nostdlib -nostartfiles -s -fPIE -ffreestanding -std=c11 -o ndless_loader.o -c ndless_loader.c
ndless_loader.c: In function 'ndless_loader':
ndless_loader.c:79:14: warning: this statement may fall through [-Wimplicit-fallthrough=]
os_misc++;
~~~~~~~^~
ndless_loader.c:80:6: note: here
case CX450_1180:
^~~~
ndless_loader.c:82:14: warning: this statement may fall through [-Wimplicit-fallthrough=]
os_misc++;
~~~~~~~^~
ndless_loader.c:83:6: note: here
case CXC440_532:
^~~~
ndless_loader.c:85:14: warning: this statement may fall through [-Wimplicit-fallthrough=]
os_misc++;
~~~~~~~^~
ndless_loader.c:86:6: note: here
case CX440_532:
^~~~
ndless_loader.c:89:9: warning: this statement may fall through [-Wimplicit-fallthrough=]
if(cas == 1 && asicflags != 1) {
^
ndless_loader.c:98:6: note: here
case CXC360_546_550:
^~~~
ndless_loader.c:100:14: warning: this statement may fall through [-Wimplicit-fallthrough=]
os_misc++;
~~~~~~~^~
ndless_loader.c:101:6: note: here
case CX360_5XX:
^~~~
ndless_loader.c:149:14: warning: this statement may fall through [-Wimplicit-fallthrough=]
os_misc++;
~~~~~~~^~
ndless_loader.c:150:6: note: here
case CX450_1180:
^~~~
ndless_loader.c:151:14: warning: this statement may fall through [-Wimplicit-fallthrough=]
os_misc++;
~~~~~~~^~
ndless_loader.c:152:6: note: here
case CXC440_532:
^~~~
ndless_loader.c:153:14: warning: this statement may fall through [-Wimplicit-fallthrough=]
os_misc++;
~~~~~~~^~
ndless_loader.c:154:6: note: here
case CX440_532:
^~~~
ndless_loader.c:155:14: warning: this statement may fall through [-Wimplicit-fallthrough=]
os_misc++;
~~~~~~~^~
ndless_loader.c:156:6: note: here
case CXC360_546_550:
^~~~
ndless_loader.c:157:14: warning: this statement may fall through [-Wimplicit-fallthrough=]
os_misc++;
~~~~~~~^~
ndless_loader.c:158:6: note: here
case CX360_5XX:
^~~~
arm-none-eabi-ld -nostdlib -nostartfiles -e ndless_loader -PIE -T ldscript ndless_loader.o -o ndless_loader.elf
arm-none-eabi-objcopy -O binary ndless_loader.elf ../ndless_loader.bin
find: paths must precede expression
Usage: find [path...] [expression]
find: paths must precede expression
Usage: find [path...] [expression]
find: paths must precede expression
Usage: find [path...] [expression]
find: paths must precede expression
Usage: find [path...] [expression]
find: paths must precede expression
Usage: find [path...] [expression]
find: paths must precede expression
Usage: find [path...] [expression]
rm -f loader.bin loader.elf
find: paths must precede expression
Usage: find [path...] [expression]
find: paths must precede expression
Usage: find [path...] [expression]
find: paths must precede expression
Usage: find [path...] [expression]
arm-none-eabi-ld -nostdlib -nostartfiles -T ldscript -PIE -flto libgcc/*.o -o loader.elf
C:/SH/sh.exe: D:\Program Files (x86)\GNU Tools Arm Embedded\7 2018-q2-update\bin/arm-none-eabi-ld.exe: cannot execute binary file
C:\SH\make.exe: *** [loader.elf] Error 126
C:\SH\mv.exe: loader.bin: No such file or directory
NONCAS_OS
rm -f *.o *.elf
rm -f ../ndless_loader.bin
arm-none-eabi-gcc -Os -Wall -W -marm -mcpu=arm926ej-s -nostdlib -nostartfiles -s -fPIE -ffreestanding -std=c11 -o ndless_loader.o -c ndless_loader.c
ndless_loader.c: In function 'ndless_loader':
ndless_loader.c:79:14: warning: this statement may fall through [-Wimplicit-fallthrough=]
os_misc++;
~~~~~~~^~
ndless_loader.c:80:6: note: here
case CX450_1180:
^~~~
ndless_loader.c:82:14: warning: this statement may fall through [-Wimplicit-fallthrough=]
os_misc++;
~~~~~~~^~
ndless_loader.c:83:6: note: here
case CXC440_532:
^~~~
ndless_loader.c:85:14: warning: this statement may fall through [-Wimplicit-fallthrough=]
os_misc++;
~~~~~~~^~
ndless_loader.c:86:6: note: here
case CX440_532:
^~~~
ndless_loader.c:89:9: warning: this statement may fall through [-Wimplicit-fallthrough=]
if(cas == 1 && asicflags != 1) {
^
ndless_loader.c:98:6: note: here
case CXC360_546_550:
^~~~
ndless_loader.c:100:14: warning: this statement may fall through [-Wimplicit-fallthrough=]
os_misc++;
~~~~~~~^~
ndless_loader.c:101:6: note: here
case CX360_5XX:
^~~~
ndless_loader.c:149:14: warning: this statement may fall through [-Wimplicit-fallthrough=]
os_misc++;
~~~~~~~^~
ndless_loader.c:150:6: note: here
case CX450_1180:
^~~~
ndless_loader.c:151:14: warning: this statement may fall through [-Wimplicit-fallthrough=]
os_misc++;
~~~~~~~^~
ndless_loader.c:152:6: note: here
case CXC440_532:
^~~~
ndless_loader.c:153:14: warning: this statement may fall through [-Wimplicit-fallthrough=]
os_misc++;
~~~~~~~^~
ndless_loader.c:154:6: note: here
case CX440_532:
^~~~
ndless_loader.c:155:14: warning: this statement may fall through [-Wimplicit-fallthrough=]
os_misc++;
~~~~~~~^~
ndless_loader.c:156:6: note: here
case CXC360_546_550:
^~~~
ndless_loader.c:157:14: warning: this statement may fall through [-Wimplicit-fallthrough=]
os_misc++;
~~~~~~~^~
ndless_loader.c:158:6: note: here
case CX360_5XX:
^~~~
arm-none-eabi-ld -nostdlib -nostartfiles -e ndless_loader -PIE -T ldscript ndless_loader.o -o ndless_loader.elf
arm-none-eabi-objcopy -O binary ndless_loader.elf ../ndless_loader.bin
find: paths must precede expression
Usage: find [path...] [expression]
find: paths must precede expression
Usage: find [path...] [expression]
find: paths must precede expression
Usage: find [path...] [expression]
find: paths must precede expression
Usage: find [path...] [expression]
find: paths must precede expression
Usage: find [path...] [expression]
find: paths must precede expression
Usage: find [path...] [expression]
rm -f loader.bin loader.elf
find: paths must precede expression
Usage: find [path...] [expression]
find: paths must precede expression
Usage: find [path...] [expression]
find: paths must precede expression
Usage: find [path...] [expression]
arm-none-eabi-ld -nostdlib -nostartfiles -T ldscript -PIE -flto libgcc/*.o -o loader.elf
C:/SH/sh.exe: D:\Program Files (x86)\GNU Tools Arm Embedded\7 2018-q2-update\bin/arm-none-eabi-ld.exe: cannot execute binary file
C:\SH\make.exe: *** [loader.elf] Error 126
C:\SH\mv.exe: loader.bin: No such file or directory


Maybe you can help me out a little bit? :)
Avatar de l’utilisateur
Shirotaku
Niveau 0: MI (Membre Inactif)
Niveau 0: MI (Membre Inactif)
Prochain niv.: 0%
 
Messages: 22
Inscription: 03 Mai 2018, 15:42
Genre: Non spécifié
Calculatrice(s):

Re: [Tuto] [EN/FR] Install nLoader / TI-Nspire CX

Message non lude dfgdysd » 02 Sep 2018, 17:02

Has anyone successfully generated their own nLoader images with source? The images I generated were much smaller than the ones provided.

The one's I generated (nLoader_CAS_OS.bin.tns) are 57KB and do not work in emulator.

The pre-generated images (nLoader_CAS_OS.bin.tns) provided are 224KB and they DO work in emulator.

EDIT: ah nevermind I figured it out. it was OS related.
Dernière édition par dfgdysd le 02 Sep 2018, 19:22, édité 1 fois.
Avatar de l’utilisateur
dfgdysd
Niveau 3: MH (Membre Habitué)
Niveau 3: MH (Membre Habitué)
Prochain niv.: 0%
 
Messages: 2
Inscription: 02 Sep 2018, 16:56
Genre: Non spécifié

Re: [Tuto] [EN/FR] Install nLoader / TI-Nspire CX

Message non lude parrotgeek1 » 02 Sep 2018, 18:40

Shirotaku a écrit:Hello,

I've tried to compile nLoader myself, but I'm not really into this. When I try running the make_for_nMaker.sh script (no files modified, just downloaded from github), I get the following errors:

sh .\make_for_nMaker.sh
CAS_OS
rm -f *.o *.elf
rm -f ../ndless_loader.bin
arm-none-eabi-gcc -Os -Wall -W -marm -mcpu=arm926ej-s -nostdlib -nostartfiles -s -fPIE -ffreestanding -std=c11 -o ndless_loader.o -c ndless_loader.c
ndless_loader.c: In function 'ndless_loader':
ndless_loader.c:79:14: warning: this statement may fall through [-Wimplicit-fallthrough=]
os_misc++;
~~~~~~~^~
ndless_loader.c:80:6: note: here
case CX450_1180:
^~~~
ndless_loader.c:82:14: warning: this statement may fall through [-Wimplicit-fallthrough=]
os_misc++;
~~~~~~~^~
ndless_loader.c:83:6: note: here
case CXC440_532:
^~~~
ndless_loader.c:85:14: warning: this statement may fall through [-Wimplicit-fallthrough=]
os_misc++;
~~~~~~~^~
ndless_loader.c:86:6: note: here
case CX440_532:
^~~~
ndless_loader.c:89:9: warning: this statement may fall through [-Wimplicit-fallthrough=]
if(cas == 1 && asicflags != 1) {
^
ndless_loader.c:98:6: note: here
case CXC360_546_550:
^~~~
ndless_loader.c:100:14: warning: this statement may fall through [-Wimplicit-fallthrough=]
os_misc++;
~~~~~~~^~
ndless_loader.c:101:6: note: here
case CX360_5XX:
^~~~
ndless_loader.c:149:14: warning: this statement may fall through [-Wimplicit-fallthrough=]
os_misc++;
~~~~~~~^~
ndless_loader.c:150:6: note: here
case CX450_1180:
^~~~
ndless_loader.c:151:14: warning: this statement may fall through [-Wimplicit-fallthrough=]
os_misc++;
~~~~~~~^~
ndless_loader.c:152:6: note: here
case CXC440_532:
^~~~
ndless_loader.c:153:14: warning: this statement may fall through [-Wimplicit-fallthrough=]
os_misc++;
~~~~~~~^~
ndless_loader.c:154:6: note: here
case CX440_532:
^~~~
ndless_loader.c:155:14: warning: this statement may fall through [-Wimplicit-fallthrough=]
os_misc++;
~~~~~~~^~
ndless_loader.c:156:6: note: here
case CXC360_546_550:
^~~~
ndless_loader.c:157:14: warning: this statement may fall through [-Wimplicit-fallthrough=]
os_misc++;
~~~~~~~^~
ndless_loader.c:158:6: note: here
case CX360_5XX:
^~~~
arm-none-eabi-ld -nostdlib -nostartfiles -e ndless_loader -PIE -T ldscript ndless_loader.o -o ndless_loader.elf
arm-none-eabi-objcopy -O binary ndless_loader.elf ../ndless_loader.bin
find: paths must precede expression
Usage: find [path...] [expression]
find: paths must precede expression
Usage: find [path...] [expression]
find: paths must precede expression
Usage: find [path...] [expression]
find: paths must precede expression
Usage: find [path...] [expression]
find: paths must precede expression
Usage: find [path...] [expression]
find: paths must precede expression
Usage: find [path...] [expression]
rm -f loader.bin loader.elf
find: paths must precede expression
Usage: find [path...] [expression]
find: paths must precede expression
Usage: find [path...] [expression]
find: paths must precede expression
Usage: find [path...] [expression]
arm-none-eabi-ld -nostdlib -nostartfiles -T ldscript -PIE -flto libgcc/*.o -o loader.elf
C:/SH/sh.exe: D:\Program Files (x86)\GNU Tools Arm Embedded\7 2018-q2-update\bin/arm-none-eabi-ld.exe: cannot execute binary file
C:\SH\make.exe: *** [loader.elf] Error 126
C:\SH\mv.exe: loader.bin: No such file or directory
CAS_OS_no_patches
rm -f *.o *.elf
rm -f ../ndless_loader.bin
arm-none-eabi-gcc -Os -Wall -W -marm -mcpu=arm926ej-s -nostdlib -nostartfiles -s -fPIE -ffreestanding -std=c11 -o ndless_loader.o -c ndless_loader.c
ndless_loader.c: In function 'ndless_loader':
ndless_loader.c:79:14: warning: this statement may fall through [-Wimplicit-fallthrough=]
os_misc++;
~~~~~~~^~
ndless_loader.c:80:6: note: here
case CX450_1180:
^~~~
ndless_loader.c:82:14: warning: this statement may fall through [-Wimplicit-fallthrough=]
os_misc++;
~~~~~~~^~
ndless_loader.c:83:6: note: here
case CXC440_532:
^~~~
ndless_loader.c:85:14: warning: this statement may fall through [-Wimplicit-fallthrough=]
os_misc++;
~~~~~~~^~
ndless_loader.c:86:6: note: here
case CX440_532:
^~~~
ndless_loader.c:89:9: warning: this statement may fall through [-Wimplicit-fallthrough=]
if(cas == 1 && asicflags != 1) {
^
ndless_loader.c:98:6: note: here
case CXC360_546_550:
^~~~
ndless_loader.c:100:14: warning: this statement may fall through [-Wimplicit-fallthrough=]
os_misc++;
~~~~~~~^~
ndless_loader.c:101:6: note: here
case CX360_5XX:
^~~~
ndless_loader.c:149:14: warning: this statement may fall through [-Wimplicit-fallthrough=]
os_misc++;
~~~~~~~^~
ndless_loader.c:150:6: note: here
case CX450_1180:
^~~~
ndless_loader.c:151:14: warning: this statement may fall through [-Wimplicit-fallthrough=]
os_misc++;
~~~~~~~^~
ndless_loader.c:152:6: note: here
case CXC440_532:
^~~~
ndless_loader.c:153:14: warning: this statement may fall through [-Wimplicit-fallthrough=]
os_misc++;
~~~~~~~^~
ndless_loader.c:154:6: note: here
case CX440_532:
^~~~
ndless_loader.c:155:14: warning: this statement may fall through [-Wimplicit-fallthrough=]
os_misc++;
~~~~~~~^~
ndless_loader.c:156:6: note: here
case CXC360_546_550:
^~~~
ndless_loader.c:157:14: warning: this statement may fall through [-Wimplicit-fallthrough=]
os_misc++;
~~~~~~~^~
ndless_loader.c:158:6: note: here
case CX360_5XX:
^~~~
arm-none-eabi-ld -nostdlib -nostartfiles -e ndless_loader -PIE -T ldscript ndless_loader.o -o ndless_loader.elf
arm-none-eabi-objcopy -O binary ndless_loader.elf ../ndless_loader.bin
find: paths must precede expression
Usage: find [path...] [expression]
find: paths must precede expression
Usage: find [path...] [expression]
find: paths must precede expression
Usage: find [path...] [expression]
find: paths must precede expression
Usage: find [path...] [expression]
find: paths must precede expression
Usage: find [path...] [expression]
find: paths must precede expression
Usage: find [path...] [expression]
rm -f loader.bin loader.elf
find: paths must precede expression
Usage: find [path...] [expression]
find: paths must precede expression
Usage: find [path...] [expression]
find: paths must precede expression
Usage: find [path...] [expression]
arm-none-eabi-ld -nostdlib -nostartfiles -T ldscript -PIE -flto libgcc/*.o -o loader.elf
C:/SH/sh.exe: D:\Program Files (x86)\GNU Tools Arm Embedded\7 2018-q2-update\bin/arm-none-eabi-ld.exe: cannot execute binary file
C:\SH\make.exe: *** [loader.elf] Error 126
C:\SH\mv.exe: loader.bin: No such file or directory
NONCAS_OS
rm -f *.o *.elf
rm -f ../ndless_loader.bin
arm-none-eabi-gcc -Os -Wall -W -marm -mcpu=arm926ej-s -nostdlib -nostartfiles -s -fPIE -ffreestanding -std=c11 -o ndless_loader.o -c ndless_loader.c
ndless_loader.c: In function 'ndless_loader':
ndless_loader.c:79:14: warning: this statement may fall through [-Wimplicit-fallthrough=]
os_misc++;
~~~~~~~^~
ndless_loader.c:80:6: note: here
case CX450_1180:
^~~~
ndless_loader.c:82:14: warning: this statement may fall through [-Wimplicit-fallthrough=]
os_misc++;
~~~~~~~^~
ndless_loader.c:83:6: note: here
case CXC440_532:
^~~~
ndless_loader.c:85:14: warning: this statement may fall through [-Wimplicit-fallthrough=]
os_misc++;
~~~~~~~^~
ndless_loader.c:86:6: note: here
case CX440_532:
^~~~
ndless_loader.c:89:9: warning: this statement may fall through [-Wimplicit-fallthrough=]
if(cas == 1 && asicflags != 1) {
^
ndless_loader.c:98:6: note: here
case CXC360_546_550:
^~~~
ndless_loader.c:100:14: warning: this statement may fall through [-Wimplicit-fallthrough=]
os_misc++;
~~~~~~~^~
ndless_loader.c:101:6: note: here
case CX360_5XX:
^~~~
ndless_loader.c:149:14: warning: this statement may fall through [-Wimplicit-fallthrough=]
os_misc++;
~~~~~~~^~
ndless_loader.c:150:6: note: here
case CX450_1180:
^~~~
ndless_loader.c:151:14: warning: this statement may fall through [-Wimplicit-fallthrough=]
os_misc++;
~~~~~~~^~
ndless_loader.c:152:6: note: here
case CXC440_532:
^~~~
ndless_loader.c:153:14: warning: this statement may fall through [-Wimplicit-fallthrough=]
os_misc++;
~~~~~~~^~
ndless_loader.c:154:6: note: here
case CX440_532:
^~~~
ndless_loader.c:155:14: warning: this statement may fall through [-Wimplicit-fallthrough=]
os_misc++;
~~~~~~~^~
ndless_loader.c:156:6: note: here
case CXC360_546_550:
^~~~
ndless_loader.c:157:14: warning: this statement may fall through [-Wimplicit-fallthrough=]
os_misc++;
~~~~~~~^~
ndless_loader.c:158:6: note: here
case CX360_5XX:
^~~~
arm-none-eabi-ld -nostdlib -nostartfiles -e ndless_loader -PIE -T ldscript ndless_loader.o -o ndless_loader.elf
arm-none-eabi-objcopy -O binary ndless_loader.elf ../ndless_loader.bin
find: paths must precede expression
Usage: find [path...] [expression]
find: paths must precede expression
Usage: find [path...] [expression]
find: paths must precede expression
Usage: find [path...] [expression]
find: paths must precede expression
Usage: find [path...] [expression]
find: paths must precede expression
Usage: find [path...] [expression]
find: paths must precede expression
Usage: find [path...] [expression]
rm -f loader.bin loader.elf
find: paths must precede expression
Usage: find [path...] [expression]
find: paths must precede expression
Usage: find [path...] [expression]
find: paths must precede expression
Usage: find [path...] [expression]
arm-none-eabi-ld -nostdlib -nostartfiles -T ldscript -PIE -flto libgcc/*.o -o loader.elf
C:/SH/sh.exe: D:\Program Files (x86)\GNU Tools Arm Embedded\7 2018-q2-update\bin/arm-none-eabi-ld.exe: cannot execute binary file
C:\SH\make.exe: *** [loader.elf] Error 126
C:\SH\mv.exe: loader.bin: No such file or directory


Maybe you can help me out a little bit? :)

You can't use Cygwin (or whatever you are using that has backslashes in paths), either use Linux, Mac or Ubuntu for Windows/WSL
My Projects:
nLoaderCAS Patcher for ControlXnLaunchy CXM fork (3.9 CAS on B&W) - News Article
Prototypes:
Upgrade EVT Nspire CAS+Fix keyboard on prototype TI-Nspire CAS Touchpad
- Highlights: Nspire CX Non-CAS OS 3.3, CX OS 4.4 special reformatting installers (both found by me on TI's site)
Discoveries:
Boot1.5 vuln (used in nLoader) • Nspire dev boardsPink CX
Je peux comprendre le français mais je ne peux pas le parler bien.
Avatar de l’utilisateur
parrotgeek1Prog.
Niveau 11: LV (Légende Vivante)
Niveau 11: LV (Légende Vivante)
Prochain niv.: 4.2%
 
Messages: 689
Inscription: 29 Mar 2016, 01:22
Localisation: USA
Genre: Homme
Calculatrice(s):
Classe: university student
GitHub: parrotgeek1

Re: [Tuto] [EN/FR] Install nLoader / TI-Nspire CX

Message non lude parrotgeek1 » 02 Sep 2018, 18:41

dfgdysd a écrit:Has anyone successfully generated their own nLoader images with source? The images I generated were much smaller than the ones provided.

The one's I generated (nLoader_CAS_OS.bin.tns) are 57KB and do not work in emulator.

The pre-generated images (nLoader_CAS_OS.bin.tns) provided are 224KB and they DO work in emulator.

Odd. What OS are you compiling on?
My Projects:
nLoaderCAS Patcher for ControlXnLaunchy CXM fork (3.9 CAS on B&W) - News Article
Prototypes:
Upgrade EVT Nspire CAS+Fix keyboard on prototype TI-Nspire CAS Touchpad
- Highlights: Nspire CX Non-CAS OS 3.3, CX OS 4.4 special reformatting installers (both found by me on TI's site)
Discoveries:
Boot1.5 vuln (used in nLoader) • Nspire dev boardsPink CX
Je peux comprendre le français mais je ne peux pas le parler bien.
Avatar de l’utilisateur
parrotgeek1Prog.
Niveau 11: LV (Légende Vivante)
Niveau 11: LV (Légende Vivante)
Prochain niv.: 4.2%
 
Messages: 689
Inscription: 29 Mar 2016, 01:22
Localisation: USA
Genre: Homme
Calculatrice(s):
Classe: university student
GitHub: parrotgeek1

Re: [Tuto] [EN/FR] Install nLoader / TI-Nspire CX

Message non lude Shirotaku » 02 Sep 2018, 20:04

parrotgeek1 a écrit:You can't use Cygwin (or whatever you are using that has backslashes in paths), either use Linux, Mac or Ubuntu for Windows/WSL


Have tried that in Ubuntu Subsystem:

sh make_for_nMaker.sh
CAS_OS
rm -f *.o *.elf
rm -f ../ndless_loader.bin
arm-none-eabi-gcc -Os -Wall -W -marm -mcpu=arm926ej-s -nostdlib -nostartfiles -s -fPIE -ffreestanding -std=c11 -o ndless_loader.o -c ndless_loader.c
arm-none-eabi-ld -nostdlib -nostartfiles -e ndless_loader -PIE -T ldscript ndless_loader.o -o ndless_loader.elf
arm-none-eabi-objcopy -O binary ndless_loader.elf ../ndless_loader.bin
find: paths must precede expression: 1
Usage: find [-H] [-L] [-P] [-Olevel] [-D help|tree|search|stat|rates|opt|exec] [path...] [expression]
find: paths must precede expression: 1
Usage: find [-H] [-L] [-P] [-Olevel] [-D help|tree|search|stat|rates|opt|exec] [path...] [expression]
find: paths must precede expression: 1
Usage: find [-H] [-L] [-P] [-Olevel] [-D help|tree|search|stat|rates|opt|exec] [path...] [expression]
find: paths must precede expression: 1
Usage: find [-H] [-L] [-P] [-Olevel] [-D help|tree|search|stat|rates|opt|exec] [path...] [expression]
find: paths must precede expression: 1
Usage: find [-H] [-L] [-P] [-Olevel] [-D help|tree|search|stat|rates|opt|exec] [path...] [expression]
find: paths must precede expression: 1
Usage: find [-H] [-L] [-P] [-Olevel] [-D help|tree|search|stat|rates|opt|exec] [path...] [expression]
rm -f loader.bin loader.elf
find: paths must precede expression: 1
Usage: find [-H] [-L] [-P] [-Olevel] [-D help|tree|search|stat|rates|opt|exec] [path...] [expression]
find: paths must precede expression: 1
Usage: find [-H] [-L] [-P] [-Olevel] [-D help|tree|search|stat|rates|opt|exec] [path...] [expression]
find: paths must precede expression: 1
Usage: find [-H] [-L] [-P] [-Olevel] [-D help|tree|search|stat|rates|opt|exec] [path...] [expression]
arm-none-eabi-ld -nostdlib -nostartfiles -T ldscript -PIE -flto libgcc/*.o -o loader.elf
libgcc/_absvdi2.o: In function `__absvdi2':
libgcc2.c:(.text+0x28): undefined reference to `abort'
libgcc/_absvsi2.o: In function `__absvsi2':
libgcc2.c:(.text+0x1c): undefined reference to `abort'
libgcc/_addvdi3.o: In function `__addvdi3':
libgcc2.c:(.text+0x54): undefined reference to `abort'
libgcc/_addvsi3.o: In function `__addvsi3':
libgcc2.c:(.text+0x3c): undefined reference to `abort'
libgcc/_mulvdi3.o: In function `__mulvdi3':
libgcc2.c:(.text+0xd0): undefined reference to `abort'
libgcc/_mulvsi3.o:libgcc2.c:(.text+0x18): more undefined references to `abort' follow
make: *** [loader.elf] Error 1
mv: cannot stat ‘loader.bin’: No such file or directory
CAS_OS_no_patches
rm -f *.o *.elf
rm -f ../ndless_loader.bin
arm-none-eabi-gcc -Os -Wall -W -marm -mcpu=arm926ej-s -nostdlib -nostartfiles -s -fPIE -ffreestanding -std=c11 -o ndless_loader.o -c ndless_loader.c
arm-none-eabi-ld -nostdlib -nostartfiles -e ndless_loader -PIE -T ldscript ndless_loader.o -o ndless_loader.elf
arm-none-eabi-objcopy -O binary ndless_loader.elf ../ndless_loader.bin
find: paths must precede expression: 1
Usage: find [-H] [-L] [-P] [-Olevel] [-D help|tree|search|stat|rates|opt|exec] [path...] [expression]
find: paths must precede expression: 1
Usage: find [-H] [-L] [-P] [-Olevel] [-D help|tree|search|stat|rates|opt|exec] [path...] [expression]
find: paths must precede expression: 1
Usage: find [-H] [-L] [-P] [-Olevel] [-D help|tree|search|stat|rates|opt|exec] [path...] [expression]
find: paths must precede expression: 1
Usage: find [-H] [-L] [-P] [-Olevel] [-D help|tree|search|stat|rates|opt|exec] [path...] [expression]
find: paths must precede expression: 1
Usage: find [-H] [-L] [-P] [-Olevel] [-D help|tree|search|stat|rates|opt|exec] [path...] [expression]
find: paths must precede expression: 1
Usage: find [-H] [-L] [-P] [-Olevel] [-D help|tree|search|stat|rates|opt|exec] [path...] [expression]
rm -f loader.bin loader.elf
find: paths must precede expression: 1
Usage: find [-H] [-L] [-P] [-Olevel] [-D help|tree|search|stat|rates|opt|exec] [path...] [expression]
find: paths must precede expression: 1
Usage: find [-H] [-L] [-P] [-Olevel] [-D help|tree|search|stat|rates|opt|exec] [path...] [expression]
find: paths must precede expression: 1
Usage: find [-H] [-L] [-P] [-Olevel] [-D help|tree|search|stat|rates|opt|exec] [path...] [expression]
arm-none-eabi-ld -nostdlib -nostartfiles -T ldscript -PIE -flto libgcc/*.o -o loader.elf
libgcc/_absvdi2.o: In function `__absvdi2':
libgcc2.c:(.text+0x28): undefined reference to `abort'
libgcc/_absvsi2.o: In function `__absvsi2':
libgcc2.c:(.text+0x1c): undefined reference to `abort'
libgcc/_addvdi3.o: In function `__addvdi3':
libgcc2.c:(.text+0x54): undefined reference to `abort'
libgcc/_addvsi3.o: In function `__addvsi3':
libgcc2.c:(.text+0x3c): undefined reference to `abort'
libgcc/_mulvdi3.o: In function `__mulvdi3':
libgcc2.c:(.text+0xd0): undefined reference to `abort'
libgcc/_mulvsi3.o:libgcc2.c:(.text+0x18): more undefined references to `abort' follow
make: *** [loader.elf] Error 1
mv: cannot stat ‘loader.bin’: No such file or directory
NONCAS_OS
rm -f *.o *.elf
rm -f ../ndless_loader.bin
arm-none-eabi-gcc -Os -Wall -W -marm -mcpu=arm926ej-s -nostdlib -nostartfiles -s -fPIE -ffreestanding -std=c11 -o ndless_loader.o -c ndless_loader.c
arm-none-eabi-ld -nostdlib -nostartfiles -e ndless_loader -PIE -T ldscript ndless_loader.o -o ndless_loader.elf
arm-none-eabi-objcopy -O binary ndless_loader.elf ../ndless_loader.bin
find: paths must precede expression: 1
Usage: find [-H] [-L] [-P] [-Olevel] [-D help|tree|search|stat|rates|opt|exec] [path...] [expression]
find: paths must precede expression: 1
Usage: find [-H] [-L] [-P] [-Olevel] [-D help|tree|search|stat|rates|opt|exec] [path...] [expression]
find: paths must precede expression: 1
Usage: find [-H] [-L] [-P] [-Olevel] [-D help|tree|search|stat|rates|opt|exec] [path...] [expression]
find: paths must precede expression: 1
Usage: find [-H] [-L] [-P] [-Olevel] [-D help|tree|search|stat|rates|opt|exec] [path...] [expression]
find: paths must precede expression: 1
Usage: find [-H] [-L] [-P] [-Olevel] [-D help|tree|search|stat|rates|opt|exec] [path...] [expression]
find: paths must precede expression: 1
Usage: find [-H] [-L] [-P] [-Olevel] [-D help|tree|search|stat|rates|opt|exec] [path...] [expression]
rm -f loader.bin loader.elf
find: paths must precede expression: 1
Usage: find [-H] [-L] [-P] [-Olevel] [-D help|tree|search|stat|rates|opt|exec] [path...] [expression]
find: paths must precede expression: 1
Usage: find [-H] [-L] [-P] [-Olevel] [-D help|tree|search|stat|rates|opt|exec] [path...] [expression]
find: paths must precede expression: 1
Usage: find [-H] [-L] [-P] [-Olevel] [-D help|tree|search|stat|rates|opt|exec] [path...] [expression]
arm-none-eabi-ld -nostdlib -nostartfiles -T ldscript -PIE -flto libgcc/*.o -o loader.elf
libgcc/_absvdi2.o: In function `__absvdi2':
libgcc2.c:(.text+0x28): undefined reference to `abort'
libgcc/_absvsi2.o: In function `__absvsi2':
libgcc2.c:(.text+0x1c): undefined reference to `abort'
libgcc/_addvdi3.o: In function `__addvdi3':
libgcc2.c:(.text+0x54): undefined reference to `abort'
libgcc/_addvsi3.o: In function `__addvsi3':
libgcc2.c:(.text+0x3c): undefined reference to `abort'
libgcc/_mulvdi3.o: In function `__mulvdi3':
libgcc2.c:(.text+0xd0): undefined reference to `abort'
libgcc/_mulvsi3.o:libgcc2.c:(.text+0x18): more undefined references to `abort' follow
make: *** [loader.elf] Error 1
mv: cannot stat ‘loader.bin’: No such file or directory


Pretty much the same in Kali Linux Subsystem:

sh make_for_nMaker.sh
CAS_OS
rm -f *.o *.elf
rm -f ../ndless_loader.bin
arm-none-eabi-gcc -Os -Wall -W -marm -mcpu=arm926ej-s -nostdlib -nostartfiles -s -fPIE -ffreestanding -std=c11 -o ndless_loader.o -c ndless_loader.c
arm-none-eabi-ld -nostdlib -nostartfiles -e ndless_loader -PIE -T ldscript ndless_loader.o -o ndless_loader.elf
arm-none-eabi-objcopy -O binary ndless_loader.elf ../ndless_loader.bin
find: paths must precede expression: `1'
find: paths must precede expression: `1'
find: paths must precede expression: `1'
find: paths must precede expression: `1'
find: paths must precede expression: `1'
find: paths must precede expression: `1'
rm -f loader.bin loader.elf
find: paths must precede expression: `1'
find: paths must precede expression: `1'
find: paths must precede expression: `1'
arm-none-eabi-ld -nostdlib -nostartfiles -T ldscript -PIE -flto libgcc/*.o -o loader.elf
arm-none-eabi-ld: libgcc/_absvdi2.o: in function `__absvdi2':
libgcc2.c:(.text+0x28): undefined reference to `abort'
arm-none-eabi-ld: libgcc/_absvsi2.o: in function `__absvsi2':
libgcc2.c:(.text+0x1c): undefined reference to `abort'
arm-none-eabi-ld: libgcc/_addvdi3.o: in function `__addvdi3':
libgcc2.c:(.text+0x54): undefined reference to `abort'
arm-none-eabi-ld: libgcc/_addvsi3.o: in function `__addvsi3':
libgcc2.c:(.text+0x3c): undefined reference to `abort'
arm-none-eabi-ld: libgcc/_mulvdi3.o: in function `__mulvdi3':
libgcc2.c:(.text+0xd0): undefined reference to `abort'
arm-none-eabi-ld: libgcc/_mulvsi3.o:libgcc2.c:(.text+0x18): more undefined references to `abort' follow
make: *** [_Makefile:18: loader.elf] Error 1
mv: cannot stat 'loader.bin': No such file or directory
CAS_OS_no_patches
rm -f *.o *.elf
rm -f ../ndless_loader.bin
arm-none-eabi-gcc -Os -Wall -W -marm -mcpu=arm926ej-s -nostdlib -nostartfiles -s -fPIE -ffreestanding -std=c11 -o ndless_loader.o -c ndless_loader.c
arm-none-eabi-ld -nostdlib -nostartfiles -e ndless_loader -PIE -T ldscript ndless_loader.o -o ndless_loader.elf
arm-none-eabi-objcopy -O binary ndless_loader.elf ../ndless_loader.bin
find: paths must precede expression: `1'
find: paths must precede expression: `1'
find: paths must precede expression: `1'
find: paths must precede expression: `1'
find: paths must precede expression: `1'
find: paths must precede expression: `1'
rm -f loader.bin loader.elf
find: paths must precede expression: `1'
find: paths must precede expression: `1'
find: paths must precede expression: `1'
arm-none-eabi-ld -nostdlib -nostartfiles -T ldscript -PIE -flto libgcc/*.o -o loader.elf
arm-none-eabi-ld: libgcc/_absvdi2.o: in function `__absvdi2':
libgcc2.c:(.text+0x28): undefined reference to `abort'
arm-none-eabi-ld: libgcc/_absvsi2.o: in function `__absvsi2':
libgcc2.c:(.text+0x1c): undefined reference to `abort'
arm-none-eabi-ld: libgcc/_addvdi3.o: in function `__addvdi3':
libgcc2.c:(.text+0x54): undefined reference to `abort'
arm-none-eabi-ld: libgcc/_addvsi3.o: in function `__addvsi3':
libgcc2.c:(.text+0x3c): undefined reference to `abort'
arm-none-eabi-ld: libgcc/_mulvdi3.o: in function `__mulvdi3':
libgcc2.c:(.text+0xd0): undefined reference to `abort'
arm-none-eabi-ld: libgcc/_mulvsi3.o:libgcc2.c:(.text+0x18): more undefined references to `abort' follow
make: *** [_Makefile:18: loader.elf] Error 1
mv: cannot stat 'loader.bin': No such file or directory
NONCAS_OS
rm -f *.o *.elf
rm -f ../ndless_loader.bin
arm-none-eabi-gcc -Os -Wall -W -marm -mcpu=arm926ej-s -nostdlib -nostartfiles -s -fPIE -ffreestanding -std=c11 -o ndless_loader.o -c ndless_loader.c
arm-none-eabi-ld -nostdlib -nostartfiles -e ndless_loader -PIE -T ldscript ndless_loader.o -o ndless_loader.elf
arm-none-eabi-objcopy -O binary ndless_loader.elf ../ndless_loader.bin
find: paths must precede expression: `1'
find: paths must precede expression: `1'
find: paths must precede expression: `1'
find: paths must precede expression: `1'
find: paths must precede expression: `1'
find: paths must precede expression: `1'
rm -f loader.bin loader.elf
find: paths must precede expression: `1'
find: paths must precede expression: `1'
find: paths must precede expression: `1'
arm-none-eabi-ld -nostdlib -nostartfiles -T ldscript -PIE -flto libgcc/*.o -o loader.elf
arm-none-eabi-ld: libgcc/_absvdi2.o: in function `__absvdi2':
libgcc2.c:(.text+0x28): undefined reference to `abort'
arm-none-eabi-ld: libgcc/_absvsi2.o: in function `__absvsi2':
libgcc2.c:(.text+0x1c): undefined reference to `abort'
arm-none-eabi-ld: libgcc/_addvdi3.o: in function `__addvdi3':
libgcc2.c:(.text+0x54): undefined reference to `abort'
arm-none-eabi-ld: libgcc/_addvsi3.o: in function `__addvsi3':
libgcc2.c:(.text+0x3c): undefined reference to `abort'
arm-none-eabi-ld: libgcc/_mulvdi3.o: in function `__mulvdi3':
libgcc2.c:(.text+0xd0): undefined reference to `abort'
arm-none-eabi-ld: libgcc/_mulvsi3.o:libgcc2.c:(.text+0x18): more undefined references to `abort' follow
make: *** [_Makefile:18: loader.elf] Error 1
mv: cannot stat 'loader.bin': No such file or directory
Avatar de l’utilisateur
Shirotaku
Niveau 0: MI (Membre Inactif)
Niveau 0: MI (Membre Inactif)
Prochain niv.: 0%
 
Messages: 22
Inscription: 03 Mai 2018, 15:42
Genre: Non spécifié
Calculatrice(s):

Re: [Tuto] [EN/FR] Install nLoader / TI-Nspire CX

Message non lude shanecantrell11@yahoo.com » 14 Sep 2018, 05:40

I finished installing the nloader image. when i reset im stuck at loading screen with the bar about 10mm full and a red circle with an X in the middle under the loading bar. please help.
Avatar de l’utilisateur
shanecantrell11@yahoo.com
Niveau 0: MI (Membre Inactif)
Niveau 0: MI (Membre Inactif)
Prochain niv.: 0%
 
Messages: 4
Inscription: 14 Sep 2018, 05:37
Genre: Non spécifié

Re: [Tuto] [EN/FR] Install nLoader / TI-Nspire CX

Message non lude critor » 14 Sep 2018, 11:35

Seems you didn't select the right files, and thus did generate and flash an unbootable image.

Try holding :nses: :nsme: :nsmo: while pressing and releasing the reset button on the back.
Image
Avatar de l’utilisateur
critorAdmin.
Niveau 18: DC (Deus ex Calculatorum)
Niveau 18: DC (Deus ex Calculatorum)
Prochain niv.: 77.4%
 
Messages: 30738
Images: 7284
Inscription: 25 Oct 2008, 00:00
Localisation: Montpellier
Genre: Homme
Calculatrice(s):
Classe: Lycée
YouTube: critor3000
Twitter: critor2000
Facebook: critor.ti

Re: [Tuto] [EN/FR] Install nLoader / TI-Nspire CX

Message non lude Shirotaku » 14 Sep 2018, 15:06

parrotgeek1 a écrit:You can't use Cygwin (or whatever you are using that has backslashes in paths), either use Linux, Mac or Ubuntu for Windows/WSL

Help pls :(
Avatar de l’utilisateur
Shirotaku
Niveau 0: MI (Membre Inactif)
Niveau 0: MI (Membre Inactif)
Prochain niv.: 0%
 
Messages: 22
Inscription: 03 Mai 2018, 15:42
Genre: Non spécifié
Calculatrice(s):

PrécédenteSuivante

Retourner vers Tutoriaux

Qui est en ligne

Utilisateurs parcourant ce forum: Aucun utilisateur enregistré et 3 invités

-
Rechercher
-
Sujets à la une
Triconcours universel de la rentrée - 2000 euro de prix !
"NumWorks++": Challenge de modification matérielle pour rajouter une puce de mémoire Flash !
Offre TI-Planet/Jarrety pour avoir la TI-83 Premium CE avec son chargeur pour 79,79€ port inclus !
Offre TI-Planet/Jarrety pour avoir la TI-Nspire CX CAS à seulement 130€ TTC port inclus!
Jailbreake ta TI-Nspire avec Ndless et profite des meilleurs jeux et applications !
Transforme ta TI-Nspire CX en console Game Boy Advance!
123456
-
Donations/Premium
Pour plus de concours, de lots, de tests, nous aider à payer le serveur et les domaines...
PayPal : paiement en ligne sécurisé - secure online payments
Découvrez les avantages d'un compte donateur !
JoinRejoignez the donors and/or premium!les donateurs et/ou premium !


Partenaires et pub
Notre partenaire Jarrety 
-
Stats.
394 utilisateurs:
>352 invités
>37 membres
>5 robots
Record simultané (sur 6 mois):
6892 utilisateurs (le 07/06/2017)
-
Autres sites intéressants
Texas Instruments Education
Global | France
 (English / Français)
Banque de programmes TI
ticalc.org
 (English)
La communauté TI-82
tout82.free.fr
 (Français)